BDBM378870 US10266535, Compound 9
SMILES N[C@@H](Cc1c[nH]c2ccccc12)C(=O)N1CCC[C@H](C1)n1nc(-c2ccc(Oc3ccccc3)cc2)c2c(N)ncnc12
InChI Key
Data  2 IC50
  Tab Delimited (TSV)   2D SDfile   Computed 3D by Vconf -m prep SDfile
Find this compound or compounds like it in BindingDB:
Activity Spreadsheet -- Enzyme Inhibition Constant Data from BindingDB
Found 2 hits for monomerid = 378870
TargetTyrosine-protein kinase BTK(Homo sapiens (Human))
Hefei Institutes of Physical Science, Chinese Academy of Sciences
US Patent
LigandPNGBDBM378870(US10266535, Compound 9)
Affinity DataIC50:  49nM. Assay description: In the experiments of in vitro enzymatic activity, the IC50 values of Compound 33, Compound 30, Compound 14, Compound 20, Compound 22, Compound 23, C...
Ligand InfoPC cidPC sid
In DepthDetails US Patent
TargetReceptor-type tyrosine-protein kinase FLT3(Homo sapiens (Human))
Hefei Institutes of Physical Science, Chinese Academy of Sciences
US Patent
LigandPNGBDBM378870(US10266535, Compound 9)
Affinity DataIC50:  1.06E+3nM. Assay description: In the experiments of in vitro enzymatic activity, the IC50 values of Compound 33, Compound 30, Compound 14, Compound 20, Compound 22, Compound 23, C...
Ligand InfoPC cidPC sid
In DepthDetails US Patent