BDBM378889 Preparation of N-(3-((4-amino-1-isopropyl-1H-pyrazolo [3,4-d] pyrimidin-3-yl) ethynyl)-4-methylphenyl)-4-(4-methylpiperazin-1-yl) methyl) benzamide ::US10266537, Compound 1
SMILES CC(C)n1nc(C#Cc2cc(NC(=O)c3ccc(CN4CCN(C)CC4)cc3)ccc2C)c2c(N)ncnc12
InChI Key InChIKey=TVJIDCCWASCDEI-UHFFFAOYSA-N
Data  1 IC50
  Tab Delimited (TSV)   2D SDfile   Computed 3D by Vconf -m prep SDfile
Find this compound or compounds like it in BindingDB:
Activity Spreadsheet -- Enzyme Inhibition Constant Data from BindingDB
Found 1 hit for monomerid = 378889
TargetProto-oncogene tyrosine-protein kinase Src [1-530](Homo sapiens (Human))
St. Chuan University
US Patent
LigandPNGBDBM378889(Preparation of N-(3-((4-amino-1-isopropyl-1H-pyraz...)
Affinity DataIC50:  4nM. Assay description: The aim of this experiment is to detect the inhibitory activity of the compounds of the present invention against in vitro protein kinases using isot...
Ligand InfoPC cidPC sid
In DepthDetails US Patent