BDBM380038 1-(1-acryloylpiperidin-3-yl)-5-(2-(4-methylpiperazin-1-yl)ethylamino)-3-(4-phenoxy-phenyl)-1H-pyrazole-4-carboxamide::US9926299, 15
SMILES CN1CCN(CCNc2c(C(N)=O)c(nn2C2CCCN(C2)C(=O)C=C)-c2ccc(Oc3ccccc3)cc2)CC1
InChI Key InChIKey=OPLKDPGERZMGDO-UHFFFAOYSA-N
Data  1 IC50
  Tab Delimited (TSV)   2D SDfile   Computed 3D by Vconf -m prep SDfile
Find this compound or compounds like it in BindingDB:
Activity Spreadsheet -- Enzyme Inhibition Constant Data from BindingDB
Found 1 hit for monomerid = 380038
TargetTyrosine-protein kinase BTK(Homo sapiens (Human))
Centaurus Biopharma
US Patent
LigandPNGBDBM380038(1-(1-acryloylpiperidin-3-yl)-5-(2-(4-methylpiperaz...)
Affinity DataIC50: <100nM. Assay description: Btk kinase activity was determined using a Homogeneous Time-Resolved Fluorescence (HTRF) methodology (Cisbio). Measurements were performed in a react...
Ligand InfoPC cidPC sid
In DepthDetails US Patent