BDBM380418 US9926299, 25 (R-isomer)
SMILES NC(=O)c1c(N)n(nc1-c1ccc(Oc2ccccc2)cc1)[C@@H]1CCN(C1)C(=O)C=C
InChI Key InChIKey=AYXRFSAXUNUBBN-MRXNPFEDSA-N
Data  1 IC50
  Tab Delimited (TSV)   2D SDfile   Computed 3D by Vconf -m prep SDfile
Find this compound or compounds like it in BindingDB:
Activity Spreadsheet -- Enzyme Inhibition Constant Data from BindingDB
Found 1 hit for monomerid = 380418
TargetTyrosine-protein kinase BTK(Homo sapiens (Human))
Centaurus Biopharma
US Patent
LigandPNGBDBM380418(US9926299, 25 (R-isomer))
Affinity DataIC50: <100nM. Assay description: Btk kinase activity was determined using a Homogeneous Time-Resolved Fluorescence (HTRF) methodology (Cisbio). Measurements were performed in a react...
Ligand InfoPC cidPC sid
In DepthDetails US Patent