BDBM380420 5-amino-3-(4-phenoxyphenyl)-1-(1-propioloylpiperidin-3-yl)-1H-pyrazole-4-carboxamide::US9926299, 26
SMILES NC(=O)c1c(N)n(nc1-c1ccc(Oc2ccccc2)cc1)C1CCCN(C1)C(=O)C#C
InChI Key InChIKey=COKMWQATWIHKMA-UHFFFAOYSA-N
Data  1 IC50
  Tab Delimited (TSV)   2D SDfile   Computed 3D by Vconf -m prep SDfile
Find this compound or compounds like it in BindingDB:
Activity Spreadsheet -- Enzyme Inhibition Constant Data from BindingDB
Found 1 hit for monomerid = 380420
TargetTyrosine-protein kinase BTK(Homo sapiens (Human))
Centaurus Biopharma
US Patent
LigandPNGBDBM380420(5-amino-3-(4-phenoxyphenyl)-1-(1-propioloylpiperid...)
Affinity DataIC50: <100nM. Assay description: Btk kinase activity was determined using a Homogeneous Time-Resolved Fluorescence (HTRF) methodology (Cisbio). Measurements were performed in a react...
Ligand InfoPC cidPC sid
In DepthDetails US Patent