BDBM380433 (R)-1-(1-acryloylpyrrolidin-3-yl)-5-amino-3-(4-(3-methoxyphenoxyl)phenyl)-1H-pyrazole-4-carboxamide::US9926299, 42
SMILES COc1cccc(Oc2ccc(cc2)-c2nn([C@@H]3CCN(C3)C(=O)C=C)c(N)c2C(N)=O)c1
InChI Key InChIKey=ROFKRYXQFXVOQX-MRXNPFEDSA-N
Data  1 IC50
  Tab Delimited (TSV)   2D SDfile   Computed 3D by Vconf -m prep SDfile
Find this compound or compounds like it in BindingDB:
Activity Spreadsheet -- Enzyme Inhibition Constant Data from BindingDB
Found 1 hit for monomerid = 380433
TargetTyrosine-protein kinase BTK(Homo sapiens (Human))
Centaurus Biopharma
US Patent
LigandPNGBDBM380433((R)-1-(1-acryloylpyrrolidin-3-yl)-5-amino-3-(4-(3-...)
Affinity DataIC50: <100nM. Assay description: Btk kinase activity was determined using a Homogeneous Time-Resolved Fluorescence (HTRF) methodology (Cisbio). Measurements were performed in a react...
Ligand InfoPC cidPC sid
In DepthDetails US Patent