BDBM383264 9-(4-chlorobenzyl)-6-methyl- 4-(2-((1-methyl-1H-pyrazol- 5-yl)amino)pyridin-4-yl)-8,9- dihydro-1,2,2a1,6- tetraazabenzo[cd]azulen- 7(6H)-one::US10278975, Compound I-40 S::US11376260, Example I-40S
SMILES CN1c2cc(cc3nnc([C@@H](Cc4ccc(Cl)cc4)CC1=O)n23)-c1ccnc(Nc2ccnn2C)c1
InChI Key InChIKey=SCQHARRJKAMRJH-IBGZPJMESA-N
Data  2 IC50
  Tab Delimited (TSV)   2D SDfile   Computed 3D by Vconf -m prep SDfile
Find this compound or compounds like it in BindingDB:
Activity Spreadsheet -- Enzyme Inhibition Constant Data from BindingDB
Found 2 hits for monomerid = 383264
TargetMitogen-activated protein kinase 6(Homo sapiens (Human))
Genentech
US Patent
LigandPNGBDBM383264(9-(4-chlorobenzyl)-6-methyl- 4-(2-((1-methyl-1H-py...)
Affinity DataIC50: <0.0200nM. Assay description: Compounds were tested in an enzymatic assay using human ERK-2 (Mitogen Activated Kinase 1), recombinantly expressed as an n-terminal 6-His fusion pro...
Ligand InfoPC cidPC sid
In DepthDetails US Patent
TargetMitogen-activated protein kinase 1(Homo sapiens (Human))
Genentech
US Patent
LigandPNGBDBM383264(9-(4-chlorobenzyl)-6-methyl- 4-(2-((1-methyl-1H-py...)
Affinity DataIC50: <0.0200nM. Assay description: Compounds were tested in an enzymatic assay using human ERK-2 (Mitogen Activated Kinase 1), recombinantly expressed as an n-terminal 6-His fusion pro...
Ligand InfoPC cidPC sid
In DepthDetails US Patent