BDBM383382 N-(1-methyl-1H-pyrazol-5- yl)-4-(9-((4-methylthiazol-2- yl)methyl)-8,9-dihydro-7H-6- oxa-1,2,2a1- triazabenzo[cd]azulen-4- yl)pyrimidin-2-amine::US10278975, Compound I-109 R
SMILES Cc1csc(O[C@@H]2CCOc3cc(cc4nnc2n34)-c2ccnc(Nc3ccnn3C)n2)n1
InChI Key InChIKey=ZWWWUZHELAGQTF-OAHLLOKOSA-N
Data  1 IC50
  Tab Delimited (TSV)   2D SDfile   Computed 3D by Vconf -m prep SDfile
Find this compound or compounds like it in BindingDB:
Activity Spreadsheet -- Enzyme Inhibition Constant Data from BindingDB
Found 1 hit for monomerid = 383382
TargetMitogen-activated protein kinase 1(Homo sapiens (Human))
Genentech
US Patent
LigandPNGBDBM383382(N-(1-methyl-1H-pyrazol-5- yl)-4-(9-((4-methylthiaz...)
Affinity DataIC50: <0.0200nM. Assay description: Compounds were tested in an enzymatic assay using human ERK-2 (Mitogen Activated Kinase 1), recombinantly expressed as an n-terminal 6-His fusion pro...
Ligand InfoPC cidPC sid
In DepthDetails US Patent