BDBM387145 2-((3aR, 7aR)-6-(2- phenylnicotinoyl)octahydro-1H- pyrrolo[2,3-c]pyridin-1- yl)isonicotinonitrile::US9938276, E5
SMILES O=C(N1CC[C@H]2CCN([C@H]2C1)c1cc(ccn1)C#N)c1cccnc1-c1ccccc1
InChI Key InChIKey=GCOSQWUZOWRHBY-UGKGYDQZSA-N
Data  2 IC50
  Tab Delimited (TSV)   2D SDfile   Computed 3D by Vconf -m prep SDfile
Find this compound or compounds like it in BindingDB:
Activity Spreadsheet -- Enzyme Inhibition Constant Data from BindingDB
Found 2 hits for monomerid = 387145
TargetOrexin/Hypocretin receptor type 1(Homo sapiens (Human))
Merck Sharp & Dohme
US Patent
LigandPNGBDBM387145(2-((3aR, 7aR)-6-(2- phenylnicotinoyl)octahydro-1H-...)
Affinity DataIC50:  1.00E+4nM. Assay description: The utility of the compounds in accordance with the present invention as orexin receptor OX1R and/or OX2R antagonists may be readily determined witho...
Ligand InfoPC cidPC sid
In DepthDetails US Patent
TargetOrexin receptor type 2(Homo sapiens (Human))
Merck Sharp & Dohme
US Patent
LigandPNGBDBM387145(2-((3aR, 7aR)-6-(2- phenylnicotinoyl)octahydro-1H-...)
Affinity DataIC50:  93.8nM. Assay description: The utility of the compounds in accordance with the present invention as orexin receptor OX1R and/or OX2R antagonists may be readily determined witho...
Ligand InfoPC cidPC sid
In DepthDetails US Patent