BDBM387158 2-{(3aR, 7aR)-6-[(3-phenylpyridin-2- yl)carbonyl]octahydro-1H-pyrrolo[2,3- c]pyridin-1-yl}pyridine-4-carbonitrile::US9938276, E18
SMILES Cc1ncccc1C(=O)N1CC[C@H]2CCN([C@H]2C1)c1cc(ccn1)C#N
InChI Key InChIKey=OUNCJXYFELDRIS-WMZOPIPTSA-N
Data  2 IC50
  Tab Delimited (TSV)   2D SDfile   Computed 3D by Vconf -m prep SDfile
Find this compound or compounds like it in BindingDB:
Activity Spreadsheet -- Enzyme Inhibition Constant Data from BindingDB
Found 2 hits for monomerid = 387158
TargetOrexin/Hypocretin receptor type 1(Homo sapiens (Human))
Merck Sharp & Dohme
US Patent
LigandPNGBDBM387158(2-{(3aR, 7aR)-6-[(3-phenylpyridin-2- yl)carbonyl]o...)
Affinity DataIC50:  1.00E+4nM. Assay description: The utility of the compounds in accordance with the present invention as orexin receptor OX1R and/or OX2R antagonists may be readily determined witho...
Ligand InfoPC cidPC sid
In DepthDetails US Patent
TargetOrexin receptor type 2(Homo sapiens (Human))
Merck Sharp & Dohme
US Patent
LigandPNGBDBM387158(2-{(3aR, 7aR)-6-[(3-phenylpyridin-2- yl)carbonyl]o...)
Affinity DataIC50:  76.9nM. Assay description: The utility of the compounds in accordance with the present invention as orexin receptor OX1R and/or OX2R antagonists may be readily determined witho...
Ligand InfoPC cidPC sid
In DepthDetails US Patent