BDBM387165 US9938276, G1
SMILES OC[C@H]1C[C@H]2CCN([C@H]2CN1C(=O)c1ccccc1-c1cc(ccn1)C#N)c1cc(ccn1)C#N
InChI Key InChIKey=JZXOOFRSLBVCDA-OTPAQWSUSA-N
Data  2 IC50
  Tab Delimited (TSV)   2D SDfile   Computed 3D by Vconf -m prep SDfile
Find this compound or compounds like it in BindingDB:
Activity Spreadsheet -- Enzyme Inhibition Constant Data from BindingDB
Found 2 hits for monomerid = 387165
TargetOrexin/Hypocretin receptor type 1(Homo sapiens (Human))
Merck Sharp & Dohme
US Patent
LigandPNGBDBM387165(US9938276, G1)
Affinity DataIC50:  2.75E+3nM. Assay description: The utility of the compounds in accordance with the present invention as orexin receptor OX1R and/or OX2R antagonists may be readily determined witho...
Ligand InfoPC cidPC sid
In DepthDetails US Patent
TargetOrexin receptor type 2(Homo sapiens (Human))
Merck Sharp & Dohme
US Patent
LigandPNGBDBM387165(US9938276, G1)
Affinity DataIC50:  8.20nM. Assay description: The utility of the compounds in accordance with the present invention as orexin receptor OX1R and/or OX2R antagonists may be readily determined witho...
Ligand InfoPC cidPC sid
In DepthDetails US Patent