BDBM389163 US9951026, 3-4
SMILES COc1ccc(Cn2cc(\C=C(/C#N)c3ccc(cc3)C(O)=O)c3ccc(Cl)nc23)cn1
InChI Key InChIKey=VMDMVFDYZXWZLE-VCHYOVAHSA-N
Data  1 IC50
  Tab Delimited (TSV)   2D SDfile   Computed 3D by Vconf -m prep SDfile
Find this compound or compounds like it in BindingDB:
Activity Spreadsheet -- Enzyme Inhibition Constant Data from BindingDB
Found 1 hit for monomerid = 389163
TargetEctonucleotide pyrophosphatase/phosphodiesterase family member 2(Homo sapiens (Human))
Pharmakea
US Patent
LigandPNGBDBM389163(US9951026, 3-4)
Affinity DataIC50: <500nM. Assay description: ATX activity is assayed in concentrated conditioned media from Hep3B human hepatocellular carcinoma cells by measuring the amount of choline released...
Ligand InfoPC cidPC sid
In DepthDetails US Patent