BDBM389164 US9951026, 5-1
SMILES CCCn1cc(cn1)-n1c(C)c(\C=C(/C#N)c2ccc(cc2)C(O)=O)c2ccsc12
InChI Key InChIKey=VTKMCADHQLAWMC-WOJGMQOQSA-N
Data  1 IC50
  Tab Delimited (TSV)   2D SDfile   Computed 3D by Vconf -m prep SDfile
Find this compound or compounds like it in BindingDB:
Activity Spreadsheet -- Enzyme Inhibition Constant Data from BindingDB
Found 1 hit for monomerid = 389164
TargetEctonucleotide pyrophosphatase/phosphodiesterase family member 2(Homo sapiens (Human))
Pharmakea
US Patent
LigandPNGBDBM389164(US9951026, 5-1)
Affinity DataIC50: >1.00E+4nM. Assay description: ATX activity is assayed in concentrated conditioned media from Hep3B human hepatocellular carcinoma cells by measuring the amount of choline released...
Ligand InfoPC cidPC sid
In DepthDetails US Patent