BDBM390525 US10442772, Example 2-171-2::US9957235, 2-171::US9957235, 2-171-1::US9957235, 2-171-2
SMILES COc1cc2n([C@H]3C[C@@H](C)CC(C)(C)C3)c(Nc3ccc(cc3)C(F)(F)F)nc2cc1CCC(O)=O
InChI Key InChIKey=GCGATJCXUINDSU-UZLBHIALSA-N
Data  4 IC50
  Tab Delimited (TSV)   2D SDfile   Computed 3D by Vconf -m prep SDfile
Find this compound or compounds like it in BindingDB:
Activity Spreadsheet -- Enzyme Inhibition Constant Data from BindingDB
Found 4 hits for monomerid = 390525
TargetIsocitrate dehydrogenase [NADP] cytoplasmic [R132H](Homo sapiens (Human))
Bayer Pharma Aktiengesellschaft
US Patent
LigandPNGBDBM390525(US10442772, Example 2-171-2 | US9957235, 2-171 | U...)
Affinity DataIC50:  20nM. Assay description: mIDH1 catalyzes the NADPH-dependent reduction of alpha-ketoglutarate (α-KG) to (2R)-2-hydroxyglutarate (2-HG). NADPH consumption was measured by...
Ligand InfoPC cidPC sid
In DepthDetails US Patent
TargetIsocitrate dehydrogenase [NADP] cytoplasmic [R132H](Homo sapiens (Human))
Bayer Pharma Aktiengesellschaft
US Patent
LigandPNGBDBM390525(US10442772, Example 2-171-2 | US9957235, 2-171 | U...)
Affinity DataIC50:  9nM. Assay description: The biochemical reactions were performed at 32° C. in 384-well plates using a reaction volume of 41 μL and the following assay buffer conditions...
Ligand InfoPC cidPC sid
In DepthDetails US Patent
TargetIsocitrate dehydrogenase [NADP] cytoplasmic [R132H](Homo sapiens (Human))
Bayer Pharma Aktiengesellschaft
US Patent
LigandPNGBDBM390525(US10442772, Example 2-171-2 | US9957235, 2-171 | U...)
Affinity DataIC50:  9nM. Assay description: mIDH1 catalyzes the NADPH-dependent reduction of alpha-ketoglutarate (α-KG) to (2R)-2-hydroxyglutarate (2-HG). NADPH consumption was measured by...
Ligand InfoPC cidPC sid
In DepthDetails US Patent
TargetIsocitrate dehydrogenase [NADP] cytoplasmic [R132H](Homo sapiens (Human))
Bayer Pharma Aktiengesellschaft
US Patent
LigandPNGBDBM390525(US10442772, Example 2-171-2 | US9957235, 2-171 | U...)
Affinity DataIC50:  40nM. Assay description: mIDH1 catalyzes the NADPH-dependent reduction of alpha-ketoglutarate (α-KG) to (2R)-2-hydroxyglutarate (2-HG). NADPH consumption was measured by...
Ligand InfoPC cidPC sid
In DepthDetails US Patent