BDBM390673 3-{4-fluoro-2-[(4-isopropoxyphenyl)amino]-1-(3,3,5,5-tetramethylcyclohexyl)-1H-benzimidazol-5-yl}propanoic acid::US10442772, Example 2-255::US9957235, 2-255
SMILES CC(C)Oc1ccc(Nc2nc3c(F)c(CCC(O)=O)ccc3n2C2CC(C)(C)CC(C)(C)C2)cc1
InChI Key InChIKey=GARRPMJMNOEDDE-UHFFFAOYSA-N
Data  2 IC50
  Tab Delimited (TSV)   2D SDfile   Computed 3D by Vconf -m prep SDfile
Find this compound or compounds like it in BindingDB:
Activity Spreadsheet -- Enzyme Inhibition Constant Data from BindingDB
Found 2 hits for monomerid = 390673
TargetIsocitrate dehydrogenase [NADP] cytoplasmic [R132H](Homo sapiens (Human))
Bayer Pharma Aktiengesellschaft
US Patent
LigandPNGBDBM390673(3-{4-fluoro-2-[(4-isopropoxyphenyl)amino]-1-(3,3,5...)
Affinity DataIC50:  20nM. Assay description: The biochemical reactions were performed at 32° C. in 384-well plates using a reaction volume of 41 μL and the following assay buffer conditions...
Ligand InfoPC cidPC sid
In DepthDetails US Patent
TargetIsocitrate dehydrogenase [NADP] cytoplasmic [R132H](Homo sapiens (Human))
Bayer Pharma Aktiengesellschaft
US Patent
LigandPNGBDBM390673(3-{4-fluoro-2-[(4-isopropoxyphenyl)amino]-1-(3,3,5...)
Affinity DataIC50:  20nM. Assay description: mIDH1 catalyzes the NADPH-dependent reduction of alpha-ketoglutarate (α-KG) to (2R)-2-hydroxyglutarate (2-HG). NADPH consumption was measured by...
Ligand InfoPC cidPC sid
In DepthDetails US Patent