BDBM392385 N-[1-(benzenesulfonyl)-2-[1- (morpholine-4-carbonyl)-3,6- dihydro-2H-pyridin-4-yl]pyrrolo [2,3-b]pyridin-5-yl]-3,4-dimethyl- 1H-pyrazole-5-carboxamide::US10301280, Compound P-2033
SMILES Cc1n[nH]c(C(=O)Nc2cnc3n(c(cc3c2)C2=CCN(CC2)C(=O)N2CCOCC2)S(=O)(=O)c2ccccc2)c1C
InChI Key InChIKey=FWQVCLULTIYSLJ-UHFFFAOYSA-N
Data  2 KI
  Tab Delimited (TSV)   2D SDfile   Computed 3D by Vconf -m prep SDfile
Find this compound or compounds like it in BindingDB:
Activity Spreadsheet -- Enzyme Inhibition Constant Data from BindingDB
Found 2 hits for monomerid = 392385
TargetMast/stem cell growth factor receptor Kit(Homo sapiens (Human))
Plexxikon
US Patent
LigandPNGBDBM392385(N-[1-(benzenesulfonyl)-2-[1- (morpholine-4-carbony...)
Affinity DataKi: <1.00E+3nM. Assay description: The c-kit mutant D816V (or kinase domain thereof) is an active kinase in AlphaScreen. IC50 values are determined with respect to inhibition of c-Kit ...
Ligand InfoPC cidPC sid
In DepthDetails US Patent
TargetMast/stem cell growth factor receptor Kit [D816V](Homo sapiens (Human))
Plexxikon
US Patent
LigandPNGBDBM392385(N-[1-(benzenesulfonyl)-2-[1- (morpholine-4-carbony...)
Affinity DataKi:  1.05E+5nM. Assay description: Assays for biochemical cell-based activity of c-kit kinase are known in the art, for example, as described in U.S. Pat. Nos. 7,498,342 and 7,846,941,...
Ligand InfoPC cidPC sid
In DepthDetails US Patent