BDBM392506 US10301280, Compound P-2290::methyl 3-[(2-phenyl-1H- pyrrolo[2,3-b]pyridin-5- yl)carbamoyl]benzoate
SMILES COC(=O)c1cccc(c1)C(=O)Nc1cnc2[nH]c(cc2c1)-c1ccccc1
InChI Key InChIKey=HAGTZSPQEXVLFE-UHFFFAOYSA-N
Data  2 KI
  Tab Delimited (TSV)   2D SDfile   Computed 3D by Vconf -m prep SDfile
Find this compound or compounds like it in BindingDB:
Activity Spreadsheet -- Enzyme Inhibition Constant Data from BindingDB
Found 2 hits for monomerid = 392506
TargetMast/stem cell growth factor receptor Kit [D816V](Homo sapiens (Human))
Plexxikon
US Patent
LigandPNGBDBM392506(US10301280, Compound P-2290 | methyl 3-[(2-phenyl-...)
Affinity DataKi: <1.00E+3nM. Assay description: Assays for biochemical cell-based activity of c-kit kinase are known in the art, for example, as described in U.S. Pat. Nos. 7,498,342 and 7,846,941,...
Ligand InfoPC cidPC sid
In DepthDetails US Patent
TargetMast/stem cell growth factor receptor Kit(Homo sapiens (Human))
Plexxikon
US Patent
LigandPNGBDBM392506(US10301280, Compound P-2290 | methyl 3-[(2-phenyl-...)
Affinity DataKi: <1.00E+3nM. Assay description: The c-kit mutant D816V (or kinase domain thereof) is an active kinase in AlphaScreen. IC50 values are determined with respect to inhibition of c-Kit ...
Ligand InfoPC cidPC sid
In DepthDetails US Patent