BDBM392529 N-((6-amino-2,4-dimethylpyridin-3- yl)methyl)-1-((3-chloroquinolin-6- yl)methyl)-3-(trifluoromethyl)-1H- pyrazole-4-carboxamide::US10301284, Example 15
SMILES Cc1cc(N)nc(C)c1CNC(=O)c1cn(Cc2ccc3ncc(Cl)cc3c2)nc1C(F)(F)F
InChI Key InChIKey=IMIXVMUJVUBYFQ-UHFFFAOYSA-N
Data  1 IC50
  Tab Delimited (TSV)   2D SDfile   Computed 3D by Vconf -m prep SDfile
Find this compound or compounds like it in BindingDB:
Activity Spreadsheet -- Enzyme Inhibition Constant Data from BindingDB
Found 1 hit for monomerid = 392529
TargetPlasma kallikrein(Homo sapiens (Human))
Lifesci Pharmaceuticals
US Patent
LigandPNGBDBM392529(N-((6-amino-2,4-dimethylpyridin-3- yl)methyl)-1-((...)
Affinity DataIC50: <100nM. Assay description: A 10 mM solution of the test compound was made in DMSO. This solution was serially diluted 1:5 in DMSO to yield 2000, 400, 80, 16, 3.2, 0.64, 0.128, ...
Ligand InfoPC cidPC sid
In DepthDetails US Patent