BDBM392675 US10301286, Example 36
SMILES CC(C)(C)N1C[C@H]([C@@H](C1)c1ccc(F)cc1F)C(=O)N1CCN(C[C@@H]1CC1CC1)[C@@H](Cc1ccc2CCCc2c1)C(O)=O
InChI Key InChIKey=FTCLAQMHDXNIJH-UMGNPTPLSA-N
Data  1 EC50
  Tab Delimited (TSV)   2D SDfile   Computed 3D by Vconf -m prep SDfile
Find this compound or compounds like it in BindingDB:
Activity Spreadsheet -- Enzyme Inhibition Constant Data from BindingDB
Found 1 hit for monomerid = 392675
TargetMelanocortin receptor 4(Homo sapiens (Human))
Astellas Pharma
US Patent
LigandPNGBDBM392675(US10301286, Example 36)
Affinity DataEC50:  1.90nM. Assay description: Experiment Method(1) Construction of Human MC Receptor-Expressing VectorA human MC4 receptor gene (GenBank Accession No.: NM_005912.2), a human MC1 r...
Ligand InfoPC cidPC sid
In DepthDetails US Patent