BDBM392682 US10301286, Example 68
SMILES C[C@H]1CN(CCN1C(=O)[C@@H]1CN(C[C@H]1c1ccc(Cl)cc1F)C1(C)CC1)[C@@H](Cc1ccc2CCCc2c1)C(O)=O
InChI Key InChIKey=BIGODMTZRHWJLL-JXWHJRSQSA-N
Data  1 EC50
  Tab Delimited (TSV)   2D SDfile   Computed 3D by Vconf -m prep SDfile
Find this compound or compounds like it in BindingDB:
Activity Spreadsheet -- Enzyme Inhibition Constant Data from BindingDB
Found 1 hit for monomerid = 392682
TargetMelanocortin receptor 4(Homo sapiens (Human))
Astellas Pharma
US Patent
LigandPNGBDBM392682(US10301286, Example 68)
Affinity DataEC50:  530nM. Assay description: Experiment Method(1) Construction of Human MC Receptor-Expressing VectorA human MC4 receptor gene (GenBank Accession No.: NM_005912.2), a human MC1 r...
Ligand InfoPC cidPC sid
In DepthDetails US Patent