BDBM393058 5-(3-chloro-4- fluorobenzenesulfon- amidomethyl)-N-(1,3- thiazol-5- ylmethyl)pyridine-2- carboxamide::US9963434, Table 12.5
SMILES Fc1ccc(cc1Cl)S(=O)(=O)NCc1ccc(nc1)C(=O)NCc1cncs1
InChI Key InChIKey=BCRKTVMTXKSBGJ-UHFFFAOYSA-N
Data  1 IC50
  Tab Delimited (TSV)   2D SDfile   Computed 3D by Vconf -m prep SDfile
Find this compound or compounds like it in BindingDB:
Activity Spreadsheet -- Enzyme Inhibition Constant Data from BindingDB
Found 1 hit for monomerid = 393058
TargetGlutamate receptor ionotropic, NMDA 2A(Homo sapiens (Human))
Luc Therapeutics
US Patent
LigandPNGBDBM393058(5-(3-chloro-4- fluorobenzenesulfon- amidomethyl)-N...)
Affinity DataIC50:  347nM. Assay description: Cell Culture and plating: HEK293 cells expressing NR1/NR2A (Chantest, Cleveland, Ohio) were grown to 70-80% confluency as an adherent monolayer in st...
Ligand InfoPC cidPC sid
In DepthDetails US Patent