BDBM393106 5-(3-chloro-4- fluorobenzenesulfon- amidomethyl)-N-[(1,5- dimethyl-1H-pyrrol-2- yl)methyl]pyrazine-2- carboxamide::US9963434, Table 12.51
SMILES Cc1ccc(CNC(=O)c2cnc(CNS(=O)(=O)c3ccc(F)c(Cl)c3)cn2)n1C
InChI Key InChIKey=DFJHXZIHDILUNR-UHFFFAOYSA-N
Data  1 IC50
  Tab Delimited (TSV)   2D SDfile   Computed 3D by Vconf -m prep SDfile
Find this compound or compounds like it in BindingDB:
Activity Spreadsheet -- Enzyme Inhibition Constant Data from BindingDB
Found 1 hit for monomerid = 393106
TargetGlutamate receptor ionotropic, NMDA 2A(Homo sapiens (Human))
Luc Therapeutics
US Patent
LigandPNGBDBM393106(5-(3-chloro-4- fluorobenzenesulfon- amidomethyl)-N...)
Affinity DataIC50:  757nM. Assay description: Cell Culture and plating: HEK293 cells expressing NR1/NR2A (Chantest, Cleveland, Ohio) were grown to 70-80% confluency as an adherent monolayer in st...
Ligand InfoPC cidPC sid
In DepthDetails US Patent