BDBM393142 5-(3-chloro-4- fluorobenzenesulfon- amidomethyl)-N-[(2- methoxypyridin-4- yl)methyl]pyridine-2- carboxamide::US9963434, Table 12.87
SMILES COc1cc(CNC(=O)c2ccc(CNS(=O)(=O)c3ccc(F)c(Cl)c3)cn2)ccn1
InChI Key InChIKey=MMRLWWRRIBNNEW-UHFFFAOYSA-N
Data  1 IC50
  Tab Delimited (TSV)   2D SDfile   Computed 3D by Vconf -m prep SDfile
Find this compound or compounds like it in BindingDB:
Activity Spreadsheet -- Enzyme Inhibition Constant Data from BindingDB
Found 1 hit for monomerid = 393142
TargetGlutamate receptor ionotropic, NMDA 2A(Homo sapiens (Human))
Luc Therapeutics
US Patent
LigandPNGBDBM393142(5-(3-chloro-4- fluorobenzenesulfon- amidomethyl)-N...)
Affinity DataIC50:  3.02E+3nM. Assay description: Cell Culture and plating: HEK293 cells expressing NR1/NR2A (Chantest, Cleveland, Ohio) were grown to 70-80% confluency as an adherent monolayer in st...
Ligand InfoPC cidPC sid
In DepthDetails US Patent