BDBM393194 5-(3-chloro-4- fluorobenzenesulfon- amidomethyl)-N-[1-(2- methyl-1,3-thiazol-5- yl)ethyl]pyrazine-2- carboxamide::US9963434, Table 12.137
SMILES CC(NC(=O)c1cnc(CNS(=O)(=O)c2ccc(F)c(Cl)c2)cn1)c1cnc(C)s1
InChI Key InChIKey=XQIRYZPBHOSOGI-UHFFFAOYSA-N
Data  1 IC50
  Tab Delimited (TSV)   2D SDfile   Computed 3D by Vconf -m prep SDfile
Find this compound or compounds like it in BindingDB:
Activity Spreadsheet -- Enzyme Inhibition Constant Data from BindingDB
Found 1 hit for monomerid = 393194
TargetGlutamate receptor ionotropic, NMDA 2A(Homo sapiens (Human))
Luc Therapeutics
US Patent
LigandPNGBDBM393194(5-(3-chloro-4- fluorobenzenesulfon- amidomethyl)-N...)
Affinity DataIC50:  180nM. Assay description: Cell Culture and plating: HEK293 cells expressing NR1/NR2A (Chantest, Cleveland, Ohio) were grown to 70-80% confluency as an adherent monolayer in st...
Ligand InfoPC cidPC sid
In DepthDetails US Patent