BDBM393526 US9963456, Example Comp.
SMILES NS(=O)(=O)OCC1CC(CC1O)n1ccc2c(NC3CCc4ccccc34)ncnc12
InChI Key InChIKey=MPUQHZXIXSTTDU-UHFFFAOYSA-N
Data  1 IC50
PDB links: 1 PDB ID matches this monomer.
  Tab Delimited (TSV)   2D SDfile   Computed 3D by Vconf -m prep SDfile
Find this compound or compounds like it in BindingDB:
Activity Spreadsheet -- Enzyme Inhibition Constant Data from BindingDB
Found 1 hit for monomerid = 393526
TargetCarbonic anhydrase 2(Homo sapiens (Human))
Taiho Pharmaceutical
US Patent
LigandPNGBDBM393526(US9963456, Example Comp.)
Affinity DataIC50:  12nM. Assay description: The carbonic anhydrase II enzyme activity inhibition was measured by measuring the esterase activity in which carbonic anhydrase II degrades 4-nitrop...
In DepthDetails US Patent