BDBM393694 (R)—N-(1-(3-Amino-4-chlorobenzo[d]isoxazol-7-yl)pyrrolidin-3-yl)-2-chloro-4-(3-(2-hydroxyeth yl)-1H-1,2,4-triazol-1-yl)benzamide::US9969724, Example 23
SMILES Nc1noc2c(ccc(Cl)c12)N1CC[C@H](C1)NC(=O)c1ccc(cc1Cl)-n1cnc(CCO)n1
InChI Key InChIKey=OJAZSHQWGVUIKW-GFCCVEGCSA-N
Data  1 IC50
  Tab Delimited (TSV)   2D SDfile   Computed 3D by Vconf -m prep SDfile
Find this compound or compounds like it in BindingDB:
Activity Spreadsheet -- Enzyme Inhibition Constant Data from BindingDB
Found 1 hit for monomerid = 393694
TargetCoagulation factor IX(Homo sapiens (Human))
Merck Sharp & Dohme
US Patent
LigandPNGBDBM393694((R)—N-(1-(3-Amino-4-chlorobenzo[d]isoxazol-7-yl)py...)
Affinity DataIC50: <100nM. Assay description: Inhibitory activity against factor IXa was tested using the substrate SPECTROFLUOR FIXa (american diagnostica inc.; 500 West Avenue, Stamford, Conn. ...
Ligand InfoPC cidPC sid
In DepthDetails US Patent