BDBM394119 (2R,6S,11R)-11-(((1- (isopropylsulfonyl)piperidin-4- yl)methyl)(methyl)amino)-3,6- dimethyl-1,2,3,4,5,6-hexahydro- 2,6-methanobenzo[d]azocin-8-ol::US9975854, Compound 55
SMILES CC(C)S(=O)(=O)N1CCC(CN(C)[C@H]2[C@H]3Cc4ccc(O)cc4[C@@]2(C)CCN3C)CC1
InChI Key InChIKey=BWJRDIAZWHAVDK-TZRRMPRUSA-N
Data  1 KI
  Tab Delimited (TSV)   2D SDfile   Computed 3D by Vconf -m prep SDfile
Find this compound or compounds like it in BindingDB:
Activity Spreadsheet -- Enzyme Inhibition Constant Data from BindingDB
Found 1 hit for monomerid = 394119
TargetKappa-type opioid receptor(Homo sapiens (Human))
Purdue Pharma
US Patent
LigandPNGBDBM394119((2R,6S,11R)-11-(((1- (isopropylsulfonyl)piperidin-...)
Affinity DataKi: >2.00E+4nM. Assay description: μ-Opioid: Radioligand dose-displacement binding assays for μ-opioid receptors used 0.3 nM [3H]-diprenorphine (Perkin Elmer, Shelton, Conn.)...
Ligand InfoPC cidPC sid
In DepthDetails US Patent