BDBM394120 (2R,6S,11R)-11-(((1-(2-hydroxy- 2-methylpropyl)piperidin-4- yl)methyl)(methyl)amino)-3,6- dimethyl-1,2,3,4,5,6-hexahydro- 2,6-methanobenzo[d]azocin-8-ol::US9975854, Compound 97
SMILES CN(CC1CCN(CC(C)(C)O)CC1)[C@H]1[C@H]2Cc3ccc(O)cc3[C@@]1(C)CCN2C
InChI Key InChIKey=RFDYJCVLXPPHID-GIFXNVAJSA-N
Data  1 KI
  Tab Delimited (TSV)   2D SDfile   Computed 3D by Vconf -m prep SDfile
Find this compound or compounds like it in BindingDB:
Activity Spreadsheet -- Enzyme Inhibition Constant Data from BindingDB
Found 1 hit for monomerid = 394120
TargetKappa-type opioid receptor(Homo sapiens (Human))
Purdue Pharma
US Patent
LigandPNGBDBM394120((2R,6S,11R)-11-(((1-(2-hydroxy- 2-methylpropyl)pip...)
Affinity DataKi:  2.12nM. Assay description: μ-Opioid: Radioligand dose-displacement binding assays for μ-opioid receptors used 0.3 nM [3H]-diprenorphine (Perkin Elmer, Shelton, Conn.)...
Ligand InfoPC cidPC sid
In DepthDetails US Patent