BDBM394248 US9975882, Example 39
SMILES CC#CC(=O)N1CC[C@@]2(C[C@@H](C2)n2nc(-c3cnn(Cc4cc(Cl)cc(c4)C(F)(F)F)c3)c(C(N)=O)c2N)C1
InChI Key InChIKey=MZIHNZJVUYOHTG-FEHRVWHQSA-N
Data  1 IC50
  Tab Delimited (TSV)   2D SDfile   Computed 3D by Vconf -m prep SDfile
Find this compound or compounds like it in BindingDB:
Activity Spreadsheet -- Enzyme Inhibition Constant Data from BindingDB
Found 1 hit for monomerid = 394248
TargetTyrosine-protein kinase BTK(Homo sapiens (Human))
Boehringer Ingelheim International
US Patent
LigandPNGBDBM394248(US9975882, Example 39)
Affinity DataIC50:  0.900nM. Assay description: Lanthscreen Eu Kinase Binding assay for BMX is performed as described above for BTK except that 1 nM human recombinant full length TEC (His-tagged) k...
Ligand InfoPC cidPC sid
In DepthDetails US Patent