BDBM394371 N-[3-[2-(difluoromethoxy)-5-vinyl- phenyl]-1-[2-(dimethylamino)-2-oxo- ethyl]pyrazol-4-yl]pyrazolo[1,5- a]pyrimidine-3-carboxamide::US10307426, Example 13
SMILES CN(C)C(=O)Cn1cc(NC(=O)c2cnn3cccnc23)c(n1)-c1cc(C=C)ccc1OC(F)F
InChI Key InChIKey=BFBOBICLTULIFF-UHFFFAOYSA-N
Data  2 KI
  Tab Delimited (TSV)   2D SDfile   Computed 3D by Vconf -m prep SDfile
Find this compound or compounds like it in BindingDB:
Activity Spreadsheet -- Enzyme Inhibition Constant Data from BindingDB
Found 2 hits for monomerid = 394371
TargetTyrosine-protein kinase JAK1(Homo sapiens (Human))
Genentech
US Patent
LigandPNGBDBM394371(N-[3-[2-(difluoromethoxy)-5-vinyl- phenyl]-1-[2-(d...)
Affinity DataKi:  0.510nM. Assay description: The activity of the isolated recombinant JAK1 and JAK2 kinase domain was measured by monitoring phosphorylation of a peptide derived from JAK3 (Val-A...
Ligand InfoPC cidPC sid
In DepthDetails US Patent
TargetTyrosine-protein kinase JAK2(Homo sapiens (Human))
Genentech
US Patent
LigandPNGBDBM394371(N-[3-[2-(difluoromethoxy)-5-vinyl- phenyl]-1-[2-(d...)
Affinity DataKi:  1.17nM. Assay description: The activity of the isolated recombinant JAK1 and JAK2 kinase domain was measured by monitoring phosphorylation of a peptide derived from JAK3 (Val-A...
Ligand InfoPC cidPC sid
In DepthDetails US Patent