BDBM394394 N-Methyl-1-[5-(2-methylphenyl)-1-(pyridin-3-ylsulfonyl)-1H-pyrrol-3-yl]methanamine::US10308605, Example 220
SMILES CNCc1cc(-c2ccccc2C)n(c1)S(=O)(=O)c1cccnc1
InChI Key InChIKey=SRTTWNYIEACZDL-UHFFFAOYSA-N
Data  1 IC50
  Tab Delimited (TSV)   2D SDfile   Computed 3D by Vconf -m prep SDfile
Find this compound or compounds like it in BindingDB:
Activity Spreadsheet -- Enzyme Inhibition Constant Data from BindingDB
Found 1 hit for monomerid = 394394
TargetPotassium-transporting ATPase alpha chain 1(Sus scrofa (Pig))
Takeda Pharmaceutical
US Patent
LigandPNGBDBM394394(N-Methyl-1-[5-(2-methylphenyl)-1-(pyridin-3-ylsulf...)
Affinity DataIC50:  36nM. Assay description: According to the method [Biochem. Biophys. Acta., 728, 31 (1983)] of Wallmark et al., a gastric mucous membrane microsomal fraction was prepared from...
Ligand InfoPC cidPC sid
In DepthDetails US Patent