BDBM395764 US10308652, Example 45
SMILES O[C@H]1CN[C@@H](c2c1nc1ccc(nn21)-c1ccc(cc1)N1CCOCC1)c1ccccc1OC(F)F
InChI Key InChIKey=VOCAWHCJRIPIIK-NZQKXSOJSA-N
Data  1 IC50
  Tab Delimited (TSV)   2D SDfile   Computed 3D by Vconf -m prep SDfile
Find this compound or compounds like it in BindingDB:
Activity Spreadsheet -- Enzyme Inhibition Constant Data from BindingDB
Found 1 hit for monomerid = 395764
TargetTumor necrosis factor(Homo sapiens (Human))
Bristol-Myers Squibb
US Patent
LigandPNGBDBM395764(US10308652, Example 45)
Affinity DataIC50:  5.50E+3nM. Assay description: Test compounds serially diluted in DMSO were plated in an assay plate (Labcyte, Cat. #LP-0200) at final concentrations ranging from 0.004 μM to ...
Ligand InfoPC cidPC sid
In DepthDetails US Patent