BDBM396121 6-(7-Amino-5-methyl-[1,2,5]oxadiazolo[3,4-b]pyridin-6-ylmethyl)-2-chloro-nicotinonitrile::US10308667, Example 24
SMILES Cc1nc2nonc2c(N)c1Cc1ccc(C#N)c(Cl)n1
InChI Key InChIKey=IFCZCDFUKHCGAK-UHFFFAOYSA-N
Data  1 IC50
  Tab Delimited (TSV)   2D SDfile   Computed 3D by Vconf -m prep SDfile
Find this compound or compounds like it in BindingDB:
Activity Spreadsheet -- Enzyme Inhibition Constant Data from BindingDB
Found 1 hit for monomerid = 396121
TargetGhrelin O-acyltransferase(Homo sapiens (Human))
Boehringer Ingelheim International
US Patent
LigandPNGBDBM396121(6-(7-Amino-5-methyl-[1,2,5]oxadiazolo[3,4-b]pyridi...)
Affinity DataIC50:  0.120nM. Assay description: Cells are plated with a density of 5000 cells/well in 384-well poly-D-lysin plates and incubated for 1 day at 37° C., 5% CO2 in DMEM medium, 10% FCS,...
Ligand InfoPC cidPC sid
In DepthDetails US Patent