BDBM396925 US9981963, Compound 16
SMILES COCCn1cc(-c2cn[nH]c2)c2cc(ncc12)C#CC(C)(C)O
InChI Key InChIKey=OSMLHZZPEHZIBE-UHFFFAOYSA-N
Data  1 IC50
  Tab Delimited (TSV)   2D SDfile   Computed 3D by Vconf -m prep SDfile
Find this compound or compounds like it in BindingDB:
Activity Spreadsheet -- Enzyme Inhibition Constant Data from BindingDB
Found 1 hit for monomerid = 396925
TargetInhibitor of nuclear factor kappa-B kinase subunit alpha(Homo sapiens (Human))
Janssen Pharmaceutica
US Patent
LigandPNGBDBM396925(US9981963, Compound 16)
Affinity DataIC50:  92nM. Assay description: Assay buffer was 50 mM Tris pH 7.5 containing 1 mM EGTA (ethylene glycol tetraacetic acid), 1 mM DTT (dithiothreitol), 0.1 mM Na3VO4, 5 mM MgCl2, 0.0...
Ligand InfoPC cidPC sid
In DepthDetails US Patent