BDBM396926 US9981963, Compound 17
SMILES CC(C)(O)C#Cc1cc2c(cn(CC3COC3)c2cn1)-c1cn[nH]c1
InChI Key InChIKey=GXEULFOFAXSGHZ-UHFFFAOYSA-N
Data  1 IC50
  Tab Delimited (TSV)   2D SDfile   Computed 3D by Vconf -m prep SDfile
Find this compound or compounds like it in BindingDB:
Activity Spreadsheet -- Enzyme Inhibition Constant Data from BindingDB
Found 1 hit for monomerid = 396926
TargetInhibitor of nuclear factor kappa-B kinase subunit alpha(Homo sapiens (Human))
Janssen Pharmaceutica
US Patent
LigandPNGBDBM396926(US9981963, Compound 17)
Affinity DataIC50:  88nM. Assay description: Assay buffer was 50 mM Tris pH 7.5 containing 1 mM EGTA (ethylene glycol tetraacetic acid), 1 mM DTT (dithiothreitol), 0.1 mM Na3VO4, 5 mM MgCl2, 0.0...
Ligand InfoPC cidPC sid
In DepthDetails US Patent