BDBM397460 US10676470, Compound 39::US11332464, Compound 39::US9988375, Compound 39
SMILES NCCCC[C@H](NC(=O)c1nccs1)C(=O)c1nc2ccccc2s1
InChI Key InChIKey=FISBAJHKMFVBLD-LBPRGKRZSA-N
Data  3 IC50
  Tab Delimited (TSV)   2D SDfile   Computed 3D by Vconf -m prep SDfile
Find this compound or compounds like it in BindingDB:
Activity Spreadsheet -- Enzyme Inhibition Constant Data from BindingDB
Found 3 hits for monomerid = 397460
TargetLys-gingipain W83(Porphyromonas gingivalis)
Cortexyme
US Patent
LigandPNGBDBM397460(US10676470, Compound 39 | US11332464, Compound 39 ...)
Affinity DataIC50:  75nM. Assay description: The specific assay conditions were as follows. Buffer: pH=7.5, 100 mM Tris-HCl, 75 mM NaCl, 2.5 mM CaCl2, 10 mM cysteine, 1% DMSO after all additions...
Ligand InfoPC cidPC sid
In DepthDetails US Patent
TargetLys-gingipain(Porphyromonas gingivalis)
Cortexyme
US Patent
LigandPNGBDBM397460(US10676470, Compound 39 | US11332464, Compound 39 ...)
Affinity DataIC50:  75nM. Assay description: Buffer: pH=7.5, 100 mM Tris-HCl, 75 mM NaCl, 2.5 mM CaCl2, 10 mM cysteine, 1% DMSO after all additions. Protein: 0.1 nM Kgp, isolated from culture of...
Ligand InfoPC cidPC sid
In DepthDetails US Patent
TargetLys-gingipain W83(Porphyromonas gingivalis)
Cortexyme
US Patent
LigandPNGBDBM397460(US10676470, Compound 39 | US11332464, Compound 39 ...)
Affinity DataIC50:  75nM. Assay description: The capacities of compounds of the present invention to inhibit the activity of lysine gingipain were measured in a fluorogenic assay similar to thos...
Ligand InfoPC cidPC sid
In DepthDetails US Patent