BDBM397638 (S)-N-(5-(4-cyano-3-((1-(dimethylamino)-4-methoxy-1-oxobutan-2-yl)amino)phenyl)pyrazin-2-yl)cyclopropanecarboxamide::US9994547, Example 7
SMILES COCC[C@H](Nc1cc(ccc1C#N)-c1cnc(NC(=O)C2CC2)cn1)C(=O)N(C)C
InChI Key InChIKey=AFECJYFFQKXJST-KRWDZBQOSA-N
Data  1 IC50
  Tab Delimited (TSV)   2D SDfile   Computed 3D by Vconf -m prep SDfile
Find this compound or compounds like it in BindingDB:
Activity Spreadsheet -- Enzyme Inhibition Constant Data from BindingDB
Found 1 hit for monomerid = 397638
TargetSerine/threonine-protein kinase TBK1(Homo sapiens (Human))
Takeda Pharmaceutical
US Patent
LigandPNGBDBM397638((S)-N-(5-(4-cyano-3-((1-(dimethylamino)-4-methoxy-...)
Affinity DataIC50:  6.31nM. Assay description: TBK1 inhibition is determined using a 384 well μlate format in buffer containing 20 mM Hepes, pH 7.4, 10 mM MgCl2, 1 mM EDTA, 0.01% Brij-L23, 1 ...
Ligand InfoPC cidPC sid
In DepthDetails US Patent