BDBM397750 N-(5-(6-cyano-5-(((2S)-1-((1,1-difluoropropan-2-yl)amino)-1-oxopropan-2-yl)amino)pyridin-3-yl)pyrazin-2-yl)cyclopropanecarboxamide::US9994547, Example 119
SMILES CC(NC(=O)[C@H](C)Nc1cc(cnc1C#N)-c1cnc(NC(=O)C2CC2)cn1)C(F)F
InChI Key InChIKey=GYOUPGNCEDQXTM-DTIOYNMSSA-N
Data  1 IC50
  Tab Delimited (TSV)   2D SDfile   Computed 3D by Vconf -m prep SDfile
Find this compound or compounds like it in BindingDB:
Activity Spreadsheet -- Enzyme Inhibition Constant Data from BindingDB
Found 1 hit for monomerid = 397750
TargetSerine/threonine-protein kinase TBK1(Homo sapiens (Human))
Takeda Pharmaceutical
US Patent
LigandPNGBDBM397750(N-(5-(6-cyano-5-(((2S)-1-((1,1-difluoropropan-2-yl...)
Affinity DataIC50:  7.94nM. Assay description: TBK1 inhibition is determined using a 384 well μlate format in buffer containing 20 mM Hepes, pH 7.4, 10 mM MgCl2, 1 mM EDTA, 0.01% Brij-L23, 1 ...
Ligand InfoPC cidPC sid
In DepthDetails US Patent