BDBM399934 US10323042, Example 14::US10738063, Example 14
SMILES Clc1ccc(cc1Cl)-c1c(nn2CCCOc12)C(=O)N1CCC1
InChI Key InChIKey=OEWWVAVGPPIPRO-UHFFFAOYSA-N
Data  4 IC50
  Tab Delimited (TSV)   2D SDfile   Computed 3D by Vconf -m prep SDfile
Find this compound or compounds like it in BindingDB:
Activity Spreadsheet -- Enzyme Inhibition Constant Data from BindingDB
Found 4 hits for monomerid = 399934
TargetcAMP-specific 3',5'-cyclic phosphodiesterase 4B(Homo sapiens (Human))
Pfizer
US Patent
LigandPNGBDBM399934(US10323042, Example 14 | US10738063, Example 14)
Affinity DataIC50:  37.1nM. Assay description: The PDE4A3, PDE4B1, PDE4C1 and PDE4D3 assays use the Scintillation Proximity Assay (SPA) technology to measure the inhibition of human recombinant PD...
Ligand InfoPC cidPC sid
In DepthDetails US Patent
LigandPNGBDBM399934(US10323042, Example 14 | US10738063, Example 14)
Affinity DataIC50:  1.27E+4nM. Assay description: A portion of the human PDE4D3 coding sequence (amino acids 50 to 672 from the sequence with accession number Q08499-2) was cloned into the baculoviru...
Ligand InfoPC cidPC sid
In DepthDetails US Patent
TargetcAMP-specific 3',5'-cyclic phosphodiesterase 4B [122-736](Homo sapiens (Human))
Pfizer
US Patent
LigandPNGBDBM399934(US10323042, Example 14 | US10738063, Example 14)
Affinity DataIC50:  37.1nM. Assay description: Human PDE4B1 coding sequence (amino acids 122 to 736 from the sequence with accession number Q07343) with the mutations resulting in the amino acid s...
Ligand InfoPC cidPC sid
In DepthDetails US Patent
LigandPNGBDBM399934(US10323042, Example 14 | US10738063, Example 14)
Affinity DataIC50:  1.27E+4nM. Assay description: The PDE4A3, PDE4B1, PDE4C1 and PDE4D3 assays use the Scintillation Proximity Assay (SPA) technology to measure the inhibition of human recombinant PD...
Ligand InfoPC cidPC sid
In DepthDetails US Patent