BDBM401414 6-(4-(2-(pyridin-4-yl)-4- (trifluoromethyl)phenoxy)phenyl) picolinamide::US10005768, Compound 28
SMILES NC(=O)c1cccc(n1)-c1ccc(Oc2ccc(cc2-c2ccncc2)C(F)(F)F)cc1
InChI Key InChIKey=AIBIMCODEKRQFJ-UHFFFAOYSA-N
Data  1 IC50
  Tab Delimited (TSV)   2D SDfile   Computed 3D by Vconf -m prep SDfile
Find this compound or compounds like it in BindingDB:
Activity Spreadsheet -- Enzyme Inhibition Constant Data from BindingDB
Found 1 hit for monomerid = 401414
TargetSodium channel protein type 9 subunit alpha(Homo sapiens (Human))
Purdue Pharma
US Patent
LigandPNGBDBM401414(6-(4-(2-(pyridin-4-yl)-4- (trifluoromethyl)phenoxy...)
Affinity DataIC50:  101nM. Assay description: The assay buffer was formulated by removing 120 mL from a 1 L bottle of fresh, sterile dH2O (Mediatech, Herndon, Va.) and adding 100 mL of 10×HBSS th...
Ligand InfoPC cidPC sid
In DepthDetails US Patent