BDBM401441 6-(4-(4-(trifluoromethyl)-3- (((3,3,3-trifluoropropyl)amino)- methyl)phenoxy)phenyl)picolin- amide::US10005768, Compound 55
SMILES NC(=O)c1cccc(n1)-c1ccc(Oc2ccc(c(CNCCC(F)(F)F)c2)C(F)(F)F)cc1
InChI Key InChIKey=XNKPKGRIEQGGKV-UHFFFAOYSA-N
Data  1 IC50
  Tab Delimited (TSV)   2D SDfile   Computed 3D by Vconf -m prep SDfile
Find this compound or compounds like it in BindingDB:
Activity Spreadsheet -- Enzyme Inhibition Constant Data from BindingDB
Found 1 hit for monomerid = 401441
TargetSodium channel protein type 9 subunit alpha(Homo sapiens (Human))
Purdue Pharma
US Patent
LigandPNGBDBM401441(6-(4-(4-(trifluoromethyl)-3- (((3,3,3-trifluoropro...)
Affinity DataIC50:  174nM. Assay description: The assay buffer was formulated by removing 120 mL from a 1 L bottle of fresh, sterile dH2O (Mediatech, Herndon, Va.) and adding 100 mL of 10×HBSS th...
Ligand InfoPC cidPC sid
In DepthDetails US Patent