BDBM401460 6-(2-chloro-4-(4-fluorophenoxy)- phenyl)picolinamide::US10005768, Compound 86
SMILES NC(=O)c1cccc(n1)-c1ccc(Oc2ccc(F)cc2)cc1Cl
InChI Key InChIKey=QYZDDPGWJFONAQ-UHFFFAOYSA-N
Data  1 IC50
  Tab Delimited (TSV)   2D SDfile   Computed 3D by Vconf -m prep SDfile
Find this compound or compounds like it in BindingDB:
Activity Spreadsheet -- Enzyme Inhibition Constant Data from BindingDB
Found 1 hit for monomerid = 401460
TargetSodium channel protein type 9 subunit alpha(Homo sapiens (Human))
Purdue Pharma
US Patent
LigandPNGBDBM401460(6-(2-chloro-4-(4-fluorophenoxy)- phenyl)picolinami...)
Affinity DataIC50:  490nM. Assay description: The assay buffer was formulated by removing 120 mL from a 1 L bottle of fresh, sterile dH2O (Mediatech, Herndon, Va.) and adding 100 mL of 10×HBSS th...
Ligand InfoPC cidPC sid
In DepthDetails US Patent