BDBM401499 6-(4-(2-(1-hydroxy-2-oxo-2- (pyrrolidin-1-yl)ethyl)-4- (trifluoromethyl)phenoxy)phenyl) picolinamide::US10005768, Compound 158
SMILES NC(=O)c1cccc(n1)-c1ccc(Oc2ccc(cc2C(O)C(=O)N2CCCC2)C(F)(F)F)cc1
InChI Key InChIKey=NNASPRXNKNAFCV-UHFFFAOYSA-N
Data  1 IC50
  Tab Delimited (TSV)   2D SDfile   Computed 3D by Vconf -m prep SDfile
Find this compound or compounds like it in BindingDB:
Activity Spreadsheet -- Enzyme Inhibition Constant Data from BindingDB
Found 1 hit for monomerid = 401499
TargetSodium channel protein type 9 subunit alpha(Homo sapiens (Human))
Purdue Pharma
US Patent
LigandPNGBDBM401499(6-(4-(2-(1-hydroxy-2-oxo-2- (pyrrolidin-1-yl)ethyl...)
Affinity DataIC50:  214nM. Assay description: The assay buffer was formulated by removing 120 mL from a 1 L bottle of fresh, sterile dH2O (Mediatech, Herndon, Va.) and adding 100 mL of 10×HBSS th...
Ligand InfoPC cidPC sid
In DepthDetails US Patent