BDBM403212 US10329302, Example 368::US10793579, Example 368::US11702424, Example 368
SMILES COc1cc2c(OC[C@H]3NC(=O)[C@@H](F)[C@H]3C3CC3)nccc2cc1C(N)=O
InChI Key InChIKey=QZNQXYJCBAWXDZ-KBMXLJTQSA-N
Data  3 IC50
  Tab Delimited (TSV)   2D SDfile   Computed 3D by Vconf -m prep SDfile
Find this compound or compounds like it in BindingDB:
Activity Spreadsheet -- Enzyme Inhibition Constant Data from BindingDB
Found 3 hits for monomerid = 403212
TargetInterleukin-1 receptor-associated kinase 4(Homo sapiens (Human))
Pfizer
US Patent
LigandPNGBDBM403212(US10329302, Example 368 | US10793579, Example 368 ...)
Affinity DataIC50:  0.300nM. Assay description: This is an in vitro assay to measure IRAK4 enzymatic activity utilizing the DELFIA (Dissociation-Enhanced Lanthanide Fluorescent Immunoassay, Perkin-...
Ligand InfoPC cidPC sid
In DepthDetails US Patent
TargetInterleukin-1 receptor-associated kinase 4(Homo sapiens (Human))
Pfizer
US Patent
LigandPNGBDBM403212(US10329302, Example 368 | US10793579, Example 368 ...)
Affinity DataIC50:  0.300nM. Assay description: This is an in vitro assay to measure IRAK4 enzymatic activity utilizing the DELFIA (Dissociation-Enhanced Lanthanide Fluorescent Immunoassay, Perkin-...
Ligand InfoPC cidPC sid
In DepthDetails US Patent
TargetInterleukin-1 receptor-associated kinase 4(Homo sapiens (Human))
Pfizer
US Patent
LigandPNGBDBM403212(US10329302, Example 368 | US10793579, Example 368 ...)
Affinity DataIC50:  0.300nM. Assay description: Protocol B: To begin the assay, 45 μL of reaction mixture containing 20 mM HEPES pH=7.5, 5 mM MgCl2, 0.0025% Brij-35, 600 μM ATP, 228 μ...
Ligand InfoPC cidPC sid
In DepthDetails US Patent