BDBM404263 2-{(3S or 3R)-7-Fluoro-4-[(3-oxo-3,4-dihydro-2H-1,4-benzoxazin-6-yl)carbonyl]-3,4-dihydro-2H-1,4-benzoxazin-3-yl}acetamide::US10017502, Example 3b
SMILES NC(=O)C[C@H]1COc2cc(F)ccc2N1C(=O)c1ccc2OCC(=O)Nc2c1
InChI Key InChIKey=WSOYYBRZDOKCSB-LBPRGKRZSA-N
Data  2 KI  2 IC50
  Tab Delimited (TSV)   2D SDfile   Computed 3D by Vconf -m prep SDfile
Find this compound or compounds like it in BindingDB:
Activity Spreadsheet -- Enzyme Inhibition Constant Data from BindingDB
Found 4 hits for monomerid = 404263
TargetMineralocorticoid receptor(Homo sapiens (Human))
Pharmaron-Beijing
Curated by ChEMBL
LigandPNGBDBM404263(2-{(3S or 3R)-7-Fluoro-4-[(3-oxo-3,4-dihydro-2H-1,...)
Affinity DataKi:  63nM. Assay description: Displacement of [3H]-aldosterone to human mineralocorticoid receptor LBD by radiometric binding assay
Ligand InfoPC cidPC sid
In DepthDetails ArticlePubMed
TargetGlucocorticoid receptor(Homo sapiens (Human))
Pharmaron-Beijing
Curated by ChEMBL
LigandPNGBDBM404263(2-{(3S or 3R)-7-Fluoro-4-[(3-oxo-3,4-dihydro-2H-1,...)
Affinity DataKi:  631nM. Assay description: Binding affinity to recombinant human GR LBD by fluormone GS red-fluorescence polarization assay
Ligand InfoPC cidPC sid
In DepthDetails ArticlePubMed
TargetMineralocorticoid receptor(Homo sapiens (Human))
Pharmaron-Beijing
Curated by ChEMBL
LigandPNGBDBM404263(2-{(3S or 3R)-7-Fluoro-4-[(3-oxo-3,4-dihydro-2H-1,...)
Affinity DataIC50:  631nM. Assay description: Antagonist activity at gal4-fused human mineralocorticoid receptor LBD expressed in UAS-MR-bla HEK293 cells by luciferase reporter gene assay
Ligand InfoPC cidPC sid
In DepthDetails ArticlePubMed
TargetMineralocorticoid receptor [729-984](Homo sapiens (Human))
Astrazeneca
US Patent
LigandPNGBDBM404263(2-{(3S or 3R)-7-Fluoro-4-[(3-oxo-3,4-dihydro-2H-1,...)
Affinity DataIC50:  270nM. Assay description: Test A1 and A2: In order to identify binding to the human MR LBD a scintillation proximity assay (SPA) was adapted to the 384-well format. The MR-LBD...
Ligand InfoPC cidPC sid
In DepthDetails US Patent