BDBM406305 US10336729, # 1.059
SMILES NC(=N)NC(=O)OCc1ccc(C#N)c(N2CCN(CC2)c2ccccc2F)c1F
InChI Key InChIKey=XXKICQRAVSDWLN-UHFFFAOYSA-N
Data  1 IC50
  Tab Delimited (TSV)   2D SDfile   Computed 3D by Vconf -m prep SDfile
Find this compound or compounds like it in BindingDB:
Activity Spreadsheet -- Enzyme Inhibition Constant Data from BindingDB
Found 1 hit for monomerid = 406305
TargetMembrane primary amine oxidase(Homo sapiens (Human))
Boehringer Ingelheim International
US Patent
LigandPNGBDBM406305(US10336729, # 1.059)
Affinity DataIC50:  151nM. Assay description: The MAO-Glo Assay (commercial available from PROMEGA, #V1402) provides a sensitive method for the measurement of monoamine oxidase (MAO) activity (Va...
Ligand InfoPC cidPC sid
In DepthDetails US Patent