BDBM408975 US10377717, Compound 104
SMILES COc1ccc(cc1C)-c1ccc(CN(C(=O)CC(C)(C)C)c2nccc3cc(CCC(O)=O)ccc23)cc1
InChI Key InChIKey=WUGMPRIOTHWMAE-UHFFFAOYSA-N
Data  1 EC50
  Tab Delimited (TSV)   2D SDfile   Computed 3D by Vconf -m prep SDfile
Find this compound or compounds like it in BindingDB:
Activity Spreadsheet -- Enzyme Inhibition Constant Data from BindingDB
Found 1 hit for monomerid = 408975
TargetBile acid receptor(Homo sapiens (Human))
Metacrine
US Patent
LigandPNGBDBM408975(US10377717, Compound 104)
Affinity DataEC50:  5.50E+3nM. Assay description: SeedingCV-1 cells were seeded at a density of 2,000,000 cells in a T175 flask with DMEM+10% charcoal double-stripped FBS and incubated at 37° C. in 5...
Ligand InfoPC cidPC sid
In DepthDetails US Patent