BDBM410088 US10370368, Example 5
SMILES CC(C)(C)S(=O)(=O)NC(=O)c1ccccc1-c1ccc2[C@@H](O)[C@H](Cc3ccc(cn3)-c3cncs3)COc2c1
InChI Key InChIKey=VNCCZLNDIWPBBX-HRFSGMKKSA-N
Data  1 EC50
  Tab Delimited (TSV)   2D SDfile   Computed 3D by Vconf -m prep SDfile
Find this compound or compounds like it in BindingDB:
Activity Spreadsheet -- Enzyme Inhibition Constant Data from BindingDB
Found 1 hit for monomerid = 410088
TargetLeukotriene B4 receptor 1(Homo sapiens (Human))
Merck Sharp & Dohme
US Patent
LigandPNGBDBM410088(US10370368, Example 5)
Affinity DataEC50:  5nM. Assay description: The ability of compounds to antagonize the human BLT1 receptor was determined using a kit to measure changes in intracellular cyclic AMP levels (cAMP...
Ligand InfoPC cidPC sid
In DepthDetails US Patent