BDBM412134 US10392402, Compound ID 50
SMILES COc1ccc(F)c(CNC(=O)Nc2cc([nH]n2)-c2ccncc2)c1
InChI Key InChIKey=GQQCURNYWSKCON-UHFFFAOYSA-N
Data  2 IC50
  Tab Delimited (TSV)   2D SDfile   Computed 3D by Vconf -m prep SDfile
Find this compound or compounds like it in BindingDB:
Activity Spreadsheet -- Enzyme Inhibition Constant Data from BindingDB
Found 2 hits for monomerid = 412134
TargetRho-associated protein kinase 2(Homo sapiens (Human))
Translational Drug Development
US Patent
LigandPNGBDBM412134(US10392402, Compound ID 50)
Affinity DataIC50:  239nM. Assay description: The following assay protocol is for measuring the phosphorylation of a peptide substrate (FAM-KKLRRTLSVA-OH wherein FAM is carboxyfluorescein). The p...
Ligand Info
In DepthDetails US Patent
TargetRho-associated protein kinase 1(Homo sapiens (Human))
Translational Drug Development
US Patent
LigandPNGBDBM412134(US10392402, Compound ID 50)
Affinity DataIC50:  1.01E+3nM. Assay description: The following assay protocol is for measuring the phosphorylation of a peptide substrate (FAM-KKLRRTLSVA-OH wherein FAM is carboxyfluorescein). The p...
Ligand Info
In DepthDetails US Patent