BDBM412736 N-(4-((2-(6-(difluoromethyl)pyridin-2-yl)-7H-pyrrolo[2,3-d]pyrimidin-4-yl)amino)pyridin-2-yl)acetamide::US10399987, Example 3
SMILES CC(=O)Nc1cc(Nc2nc(nc3[nH]ccc23)-c2cccc(n2)C(F)F)ccn1
InChI Key InChIKey=JQZQDEAJANBRTM-UHFFFAOYSA-N
Data  2 IC50
  Tab Delimited (TSV)   2D SDfile   Computed 3D by Vconf -m prep SDfile
Find this compound or compounds like it in BindingDB:
Activity Spreadsheet -- Enzyme Inhibition Constant Data from BindingDB
Found 2 hits for monomerid = 412736
TargetTGF-beta receptor type-2(Homo sapiens (Human))
Bristol-Myer Squibb
US Patent
LigandPNGBDBM412736(N-(4-((2-(6-(difluoromethyl)pyridin-2-yl)-7H-pyrro...)
Affinity DataIC50:  190nM. Assay description: Assays are conducted in 1536-well plates and 2 mL reactions are prepared from addition of HIS-TGFβR1 T204D or HIS-TGFβR2 WT, anti-HIS detec...
Ligand Info
In DepthDetails US Patent
TargetTGF-beta receptor type-1 [4-503,T204D](Homo sapiens (Human))
Bristol-Myer Squibb
US Patent
LigandPNGBDBM412736(N-(4-((2-(6-(difluoromethyl)pyridin-2-yl)-7H-pyrro...)
Affinity DataIC50:  0.780nM. Assay description: Assays are conducted in 1536-well plates and 2 mL reactions are prepared from addition of HIS-TGFβR1 T204D or HIS-TGFβR2 WT, anti-HIS detec...
Ligand Info
In DepthDetails US Patent